Reaction Details
TargetSterol O-acyltransferase 1
LigandBDBM50438735
Substrate/Competitorn/a
Meas. Tech.ChEMBL_976300 (CHEMBL2415208)
IC50>10000±n/a nM
Citation Dow, RLAndrews, MPLi, JCMichael Gibbs, EGuzman-Perez, ALaperle, JLLi, QMather, DMunchhof, MJNiosi, MPatel, LPerreault, CTapley, SZavadoski, WJ Defining the key pharmacophore elements of PF-04620110: discovery of a potent, orally-active, neutral DGAT-1 inhibitor. Bioorg Med Chem21:5081-97 (2013) 
 
Sterol O-acyltransferase 1
Name:Sterol O-acyltransferase 1
Type:Multi-pass membrane protein may form homo- or heterodimers.
Mol. Mass.:64751.94
Organism:Homo sapiens (Human)
Description:P35610
Residue:550
BDBM50438735
NameBDBM50438735
Synonyms:CHEMBL2414670
TypeSmall organic molecule
Emp. Form.C23H26N6O3
Mol. Mass.434.4909
SMILESCc1noc(C[C@H]2CC[C@@H](CC2)c2ccc(cc2)N2CCOc3ncnc(N)c3C2=O)n1