Reaction Details
TargetDiacylglycerol O-acyltransferase 1
LigandBDBM50438733
Substrate/Competitorn/a
Meas. Tech.ChEMBL_976373 (CHEMBL2415509)
IC50 41±n/a nM
Citation Dow, RLAndrews, MPLi, JCMichael Gibbs, EGuzman-Perez, ALaperle, JLLi, QMather, DMunchhof, MJNiosi, MPatel, LPerreault, CTapley, SZavadoski, WJ Defining the key pharmacophore elements of PF-04620110: discovery of a potent, orally-active, neutral DGAT-1 inhibitor. Bioorg Med Chem21:5081-97 (2013) 
 
Diacylglycerol O-acyltransferase 1
Name:Diacylglycerol O-acyltransferase 1
Type:Protein
Mol. Mass.:55297.82
Organism:Homo sapiens (Human)
Description:O75907
Residue:488
BDBM50438733
NameBDBM50438733
Synonyms:CHEMBL2414667
TypeSmall organic molecule
Emp. Form.C21H23N5O2
Mol. Mass.377.4396
SMILESNc1ncnc2OCCN(c3ccc(cc3)[C@H]3CC[C@H](CC#N)CC3)C(=O)c12