Reaction Details
TargetFatty-acid amide hydrolase 1
LigandBDBM23120
Substrate/Competitorn/a
Meas. Tech.ChEMBL_976850 (CHEMBL2417341)
IC50 33±n/a nM
Citation Wu, HKelley, CJPino-Figueroa, AVu, HDMaher, TJ Macamides and their synthetic analogs: evaluation of in vitro FAAH inhibition. Bioorg Med Chem21:5188-97 (2013) 
 
Fatty-acid amide hydrolase 1
Name:Fatty-acid amide hydrolase 1
Type:Protein
Mol. Mass.:63071.19
Organism:Homo sapiens (Human)
Description:O00519
Residue:579
BDBM23120
NameBDBM23120
Synonyms:7-phenyl-1-[5-(pyridin-2-yl)-1,3-oxazol-2-yl]heptan-1-one OL-135
TypeSmall organic molecule
Emp. Form.C21H22N2O2
Mol. Mass.334.4116
SMILESO=C(CCCCCCc1ccccc1)c1ncc(o1)-c1ccccn1