Reaction Details
TargetOrexin/Hypocretin receptor type 1
LigandBDBM50318701
Substrate/Competitorn/a
Meas. Tech.ChEMBL_977031 (CHEMBL2416555)
Ki 0.600000±n/a nM
Citation Lebold, TPBonaventure, PShireman, BT Selective orexin receptor antagonists. Bioorg Med Chem Lett23:4761-9 (2013) 
 
Orexin/Hypocretin receptor type 1
Name:Orexin/Hypocretin receptor type 1
Type:Protein
Mol. Mass.:47554.50
Organism:Homo sapiens (Human)
Description:O43613
Residue:425
BDBM50318701
NameBDBM50318701
Synonyms:CHEMBL1083659 [(7R)-4-(5-Chloro-1,3-benzoxazol-2-yl)-7-methyl-1,4-diazepan-1-yl][5-methyl-2-(2H-1,2,3-triazol-2-yl)phenyl]methanone
TypeSmall organic molecule
Emp. Form.C23H23ClN6O2
Mol. Mass.450.921
SMILESC[C@@H]1CCN(CCN1C(=O)c1cc(C)ccc1-n1nccn1)c1nc2cc(Cl)ccc2o1