Reaction Details
TargetOrexin/Hypocretin receptor type 1
LigandBDBM104692
Substrate/Competitorn/a
Meas. Tech.ChEMBL_977031 (CHEMBL2416555)
Ki 2.5±n/a nM
Citation Lebold, TPBonaventure, PShireman, BT Selective orexin receptor antagonists. Bioorg Med Chem Lett23:4761-9 (2013) 
 
Orexin/Hypocretin receptor type 1
Name:Orexin/Hypocretin receptor type 1
Type:Protein
Mol. Mass.:47554.50
Organism:Homo sapiens (Human)
Description:O43613
Residue:425
BDBM104692
NameBDBM104692
Synonyms:US8569311, E-5
TypeSmall organic molecule
Emp. Form.C24H25FN4O2
Mol. Mass.420.4793
SMILESC[C@@H]1CC[C@@H](COc2ccc(F)cn2)CN1C(=O)c1cc(C)ccc1-c1ncccn1