Reaction Details
TargetCytochrome P450 2C8
LigandBDBM50438846
Substrate/Competitorn/a
Meas. Tech.ChEMBL_977241 (CHEMBL2416912)
IC50 220±n/a nM
Citation Tukulula, MNjoroge, MMugumbate, GCGut, JRosenthal, PJBarteau, SStreckfuss, JHeudi, OKameni-Tcheudji, JChibale, K Tetrazole-based deoxyamodiaquines: synthesis, ADME/PK profiling and pharmacological evaluation as potential antimalarial agents. Bioorg Med Chem21:4904-13 (2013) 
 
Cytochrome P450 2C8
Name:Cytochrome P450 2C8
Type:Protein
Mol. Mass.:55839.23
Organism:Homo sapiens (Human)
Description:P10632
Residue:490
BDBM50438846
NameBDBM50438846
Synonyms:CHEMBL2413881
TypeSmall organic molecule
Emp. Form.C25H30ClN7
Mol. Mass.464.006
SMILESCCN(CC)C(c1nnnn1C(C)(C)C)c1cccc(Nc2ccnc3cc(Cl)ccc23)c1