Reaction Details
TargetDNA-(apurinic or apyrimidinic site) endonuclease
LigandBDBM34905
Substrate/Competitorn/a
Meas. Tech.ChEMBL_978866 (CHEMBL2423657)
IC50>200000±n/a nM
Citation Raoof, ADepledge, PHamilton, NMHamilton, NSHitchin, JRHopkins, GVJordan, AMMaguire, LAMcGonagle, AEMould, DPRushbrooke, MSmall, HFSmith, KMThomson, GJTurlais, FWaddell, IDWaszkowycz, BWatson, AJOgilvie, DJ Toxoflavins and deazaflavins as the first reported selective small molecule inhibitors of tyrosyl-DNA phosphodiesterase II. J Med Chem56:6352-70 (2013) 
 
DNA-(apurinic or apyrimidinic site) endonuclease
Name:DNA-(apurinic or apyrimidinic site) endonuclease
Type:Protein
Mol. Mass.:35560.12
Organism:Homo sapiens (Human)
Description:P27695
Residue:318
BDBM34905
NameBDBM34905
Synonyms:1,6-dimethyl-3-propyl-pyrimido[5,4-e][1,2,4]triazine-5,7-dione 1,6-dimethyl-3-propylpyrimido[5,4-e][1,2,4]triazine-5,7-dione SMR000291200 cid_3164059
TypeSmall organic molecule
Emp. Form.C10H13N5O2
Mol. Mass.235.2425
SMILESCCCc1nn(C)c2nc(=O)n(C)c(=O)c2n1