Reaction Details
TargetCytochrome P450 11B2, mitochondrial
LigandBDBM8913
Substrate/Competitorn/a
Meas. Tech.ChEMBL_979122 (CHEMBL2421737)
IC50 29±n/a nM
Citation Pinto-Bazurco Mendieta, MAHu, QEngel, MHartmann, RW Highly potent and selective nonsteroidal dual inhibitors of CYP17/CYP11B2 for the treatment of prostate cancer to reduce risks of cardiovascular diseases. J Med Chem56:6101-7 (2013) 
 
Cytochrome P450 11B2, mitochondrial
Name:Cytochrome P450 11B2, mitochondrial
Type:Protein
Mol. Mass.:57582.15
Organism:Homo sapiens (Human)
Description:P19099
Residue:503
BDBM8913
NameBDBM8913
Synonyms:3-(1-Chloro-7-methoxy-2-naphthyl)pyridine Pyridine-substituted naphthalene 14 | US9271963, 14
TypeSmall organic molecule
Emp. Form.C16H12ClNO
Mol. Mass.269.726
SMILESCOc1ccc2ccc(-c3cccnc3)c(Cl)c2c1