Reaction Details
TargetCytochrome P450 11B2, mitochondrial
LigandBDBM50439004
Substrate/Competitorn/a
Meas. Tech.ChEMBL_979122 (CHEMBL2421737)
IC50 68±n/a nM
Citation Pinto-Bazurco Mendieta, MAHu, QEngel, MHartmann, RW Highly potent and selective nonsteroidal dual inhibitors of CYP17/CYP11B2 for the treatment of prostate cancer to reduce risks of cardiovascular diseases. J Med Chem56:6101-7 (2013) 
 
Cytochrome P450 11B2, mitochondrial
Name:Cytochrome P450 11B2, mitochondrial
Type:Protein
Mol. Mass.:57582.15
Organism:Homo sapiens (Human)
Description:P19099
Residue:503
BDBM50439004
NameBDBM50439004
Synonyms:CHEMBL193863
TypeSmall organic molecule
Emp. Form.C16H13NO
Mol. Mass.235.2805
SMILESCOc1ccc2ccc(cc2c1)-c1cccnc1