Reaction Details
TargetCytochrome P450 11B2, mitochondrial
LigandBDBM8904
Substrate/Competitorn/a
Meas. Tech.ChEMBL_979122 (CHEMBL2421737)
IC50 28±n/a nM
Citation Pinto-Bazurco Mendieta, MAHu, QEngel, MHartmann, RW Highly potent and selective nonsteroidal dual inhibitors of CYP17/CYP11B2 for the treatment of prostate cancer to reduce risks of cardiovascular diseases. J Med Chem56:6101-7 (2013) 
 
Cytochrome P450 11B2, mitochondrial
Name:Cytochrome P450 11B2, mitochondrial
Type:Protein
Mol. Mass.:57582.15
Organism:Homo sapiens (Human)
Description:P19099
Residue:503
BDBM8904
NameBDBM8904
Synonyms:3-(2-Naphthyl)pyridine CHEMBL365735 US9271963, 1
TypeSmall organic molecule
Emp. Form.C15H11N
Mol. Mass.205.2545
SMILESc1ccc2cc(ccc2c1)-c1cccnc1