Reaction Details
TargetCytochrome P450 11B1, mitochondrial
LigandBDBM50439062
Substrate/Competitorn/a
Meas. Tech.ChEMBL_980062 (CHEMBL2423499)
IC50 5.0±n/a nM
Citation Emmerich, JHu, QHanke, NHartmann, RW Cushing's syndrome: development of highly potent and selective CYP11B1 inhibitors of the (pyridylmethyl)pyridine type. J Med Chem56:6022-32 (2013) 
 
Cytochrome P450 11B1, mitochondrial
Name:Cytochrome P450 11B1, mitochondrial
Type:Enzyme
Mol. Mass.:57591.44
Organism:Homo sapiens (Human)
Description:P15538
Residue:503
BDBM50439062
NameBDBM50439062
Synonyms:CHEMBL2417614
TypeSmall organic molecule
Emp. Form.C18H16N2O
Mol. Mass.276.3324
SMILESCOc1cncc(Cc2ccc(nc2)-c2ccccc2)c1