Reaction Details
TargetKinesin-like protein KIF11
LigandBDBM23772
Substrate/Competitorn/a
Meas. Tech.ChEMBL_977859 (CHEMBL2421461)
IC50 352±n/a nM
Citation Talapatra, SKAnthony, NGMackay, SPKozielski, F Mitotic kinesin Eg5 overcomes inhibition to the phase I/II clinical candidate SB743921 by an allosteric resistance mechanism. J Med Chem56:6317-29 (2013) 
 
Kinesin-like protein KIF11
Name:Kinesin-like protein KIF11
Type:PROTEIN
Mol. Mass.:119138.97
Organism:Homo sapiens (Human)
Description:ChEMBL_1457426
Residue:1056
BDBM23772
NameBDBM23772
Synonyms:(2R)-2-amino-3-[(triphenylmethyl)sulfanyl]propanoic acid CHEMBL392695 S-Trityl-L-Cysteine (STLC), 1 Tritylcysteine
TypeSmall organic molecule
Emp. Form.C22H21NO2S
Mol. Mass.363.473
SMILESN[C@@H](CSC(c1ccccc1)(c1ccccc1)c1ccccc1)C(O)=O