Reaction Details
TargetO-acetylserine sulfhydrylase
LigandBDBM50427257
Substrate/Competitorn/a
Meas. Tech.ChEMBL_978241 (CHEMBL2423610)
IC50 2900±n/a nM
Citation Poyraz, OJeankumar, VUSaxena, SSchnell, RHaraldsson, MYogeeswari, PSriram, DSchneider, G Structure-guided design of novel thiazolidine inhibitors of O-acetyl serine sulfhydrylase from Mycobacterium tuberculosis. J Med Chem56:6457-66 (2013) 
 
O-acetylserine sulfhydrylase
Name:O-acetylserine sulfhydrylase
Type:PROTEIN
Mol. Mass.:32747.29
Organism:Mycobacterium tuberculosis
Description:ChEMBL_978239
Residue:310
BDBM50427257
NameBDBM50427257
Synonyms:CHEMBL2325118
TypeSmall organic molecule
Emp. Form.C22H32N4O8
Mol. Mass.480.5115
SMILESCC[C@H](C)[C@H](NC(=O)[C@H](CO)NC(=O)[C@H](Cc1ccccc1)NC(=O)[C@@H](N)CC(O)=O)C(O)=O