Reaction Details
TargetShort transient receptor potential channel 6
LigandBDBM50439220
Substrate/Competitorn/a
Meas. Tech.ChEMBL_978640 (CHEMBL2422303)
IC50 16±n/a nM
Citation Washburn, DGHolt, DADodson, JMcAtee, JJTerrell, LRBarton, LManns, SWaszkiewicz, APritchard, CGillie, DJMorrow, DMDavenport, EALozinskaya, IMGuss, JBasilla, JBNegron, LKKlein, MWillette, RNFries, REJensen, TCXu, XSchnackenberg, CGMarino, JP The discovery of potent blockers of the canonical transient receptor channels, TRPC3 and TRPC6, based on an anilino-thiazole pharmacophore. Bioorg Med Chem Lett23:4979-84 (2013) 
 
Short transient receptor potential channel 6
Name:Short transient receptor potential channel 6
Type:PROTEIN
Mol. Mass.:106326.67
Organism:Homo sapiens (Human)
Description:ChEMBL_107640
Residue:931
BDBM50439220
NameBDBM50439220
Synonyms:CHEMBL2418807
TypeSmall organic molecule
Emp. Form.C18H21N3O3S
Mol. Mass.359.443
SMILESCC1CCCN(C1C)C(=O)c1csc(Nc2ccc3OCOc3c2)n1