Reaction Details
TargetArginase-2, mitochondrial
LigandBDBM50350311
Substrate/Competitorn/a
Meas. Tech.ChEMBL_978892 (CHEMBL2423683)
IC50 2150±n/a nM
Citation Golebiowski, AWhitehouse, DBeckett, RPVan Zandt, MJi, MKRyder, TRJagdmann, EAndreoli, MLee, YSheeler, RConway, BOlczak, JMazur, MCzestkowski, WPiotrowska, WCousido-Siah, ARuiz, FXMitschler, APodjarny, ASchroeter, H Synthesis of quaternarya-amino acid-based arginase inhibitors via the Ugi reaction. Bioorg Med Chem Lett23:4837-41 (2013) 
 
Arginase-2, mitochondrial
Name:Arginase-2, mitochondrial
Type:PROTEIN
Mol. Mass.:38576.93
Organism:Homo sapiens (Human)
Description:ChEMBL_978892
Residue:354
BDBM50350311
NameBDBM50350311
Synonyms:CHEMBL1812661
TypeSmall organic molecule
Emp. Form.C6H14BNO4
Mol. Mass.174.991
SMILES[NH3+][C@@H](CCCCB(O)O)C([O-])=O