Reaction Details
TargetArginase-2, mitochondrial
LigandBDBM50439244
Substrate/Competitorn/a
Meas. Tech.ChEMBL_978892 (CHEMBL2423683)
IC50 47±n/a nM
Citation Golebiowski, AWhitehouse, DBeckett, RPVan Zandt, MJi, MKRyder, TRJagdmann, EAndreoli, MLee, YSheeler, RConway, BOlczak, JMazur, MCzestkowski, WPiotrowska, WCousido-Siah, ARuiz, FXMitschler, APodjarny, ASchroeter, H Synthesis of quaternarya-amino acid-based arginase inhibitors via the Ugi reaction. Bioorg Med Chem Lett23:4837-41 (2013) 
 
Arginase-2, mitochondrial
Name:Arginase-2, mitochondrial
Type:PROTEIN
Mol. Mass.:38576.93
Organism:Homo sapiens (Human)
Description:ChEMBL_978892
Residue:354
BDBM50439244
NameBDBM50439244
Synonyms:CHEMBL2418829
TypeSmall organic molecule
Emp. Form.C20H31BN2O4
Mol. Mass.374.282
SMILESNC(CCCCB(O)O)(C1CC2CCC(C1)N2Cc1ccccc1)C(O)=O