Reaction Details
TargetArginase-2, mitochondrial
LigandBDBM50439247
Substrate/Competitorn/a
Meas. Tech.ChEMBL_978892 (CHEMBL2423683)
IC50 23±n/a nM
Citation Golebiowski, AWhitehouse, DBeckett, RPVan Zandt, MJi, MKRyder, TRJagdmann, EAndreoli, MLee, YSheeler, RConway, BOlczak, JMazur, MCzestkowski, WPiotrowska, WCousido-Siah, ARuiz, FXMitschler, APodjarny, ASchroeter, H Synthesis of quaternarya-amino acid-based arginase inhibitors via the Ugi reaction. Bioorg Med Chem Lett23:4837-41 (2013) 
 
Arginase-2, mitochondrial
Name:Arginase-2, mitochondrial
Type:PROTEIN
Mol. Mass.:38576.93
Organism:Homo sapiens (Human)
Description:ChEMBL_978892
Residue:354
BDBM50439247
NameBDBM50439247
Synonyms:CHEMBL2418831
TypeSmall organic molecule
Emp. Form.C20H29BCl2N2O4
Mol. Mass.443.172
SMILESNC(CCCCB(O)O)(C1CC2CCC(C1)N2Cc1ccc(Cl)c(Cl)c1)C(O)=O