Reaction Details
TargetArginase-1
LigandBDBM50439246
Substrate/Competitorn/a
Meas. Tech.ChEMBL_978893 (CHEMBL2423684)
IC50 17±n/a nM
Citation Golebiowski, AWhitehouse, DBeckett, RPVan Zandt, MJi, MKRyder, TRJagdmann, EAndreoli, MLee, YSheeler, RConway, BOlczak, JMazur, MCzestkowski, WPiotrowska, WCousido-Siah, ARuiz, FXMitschler, APodjarny, ASchroeter, H Synthesis of quaternarya-amino acid-based arginase inhibitors via the Ugi reaction. Bioorg Med Chem Lett23:4837-41 (2013) 
 
Arginase-1
Name:Arginase-1
Type:PROTEIN
Mol. Mass.:34737.53
Organism:Homo sapiens (Human)
Description:ChEMBL_978893
Residue:322
BDBM50439246
NameBDBM50439246
Synonyms:CHEMBL2418830
TypeSmall organic molecule
Emp. Form.C20H30BClN2O4
Mol. Mass.408.727
SMILESNC(CCCCB(O)O)(C1CC2CCC(C1)N2Cc1ccc(Cl)cc1)C(O)=O