Reaction Details
TargetRenin
LigandBDBM50402219
Substrate/Competitorn/a
Meas. Tech.ChEMBL_979178 (CHEMBL2421978)
IC50 1.3±n/a nM
Citation Mori, YOgawa, YMochizuki, ANakamura, YFujimoto, TSugita, CMiyazaki, STamaki, KNagayama, TNagai, YInoue, SChiba, KNishi, T Synthesis and optimization of novel (3S,5R)-5-(2,2-dimethyl-5-oxo-4-phenylpiperazin-1-yl)piperidine-3-carboxamides as orally active renin inhibitors. Bioorg Med Chem21:5907-22 (2013) 
 
Renin
Name:Renin
Type:Enzyme
Mol. Mass.:45058.99
Organism:Homo sapiens (Human)
Description:n/a
Residue:406
BDBM50402219
NameBDBM50402219
Synonyms:CHEMBL2204732
TypeSmall organic molecule
Emp. Form.C26H41ClN4O3
Mol. Mass.493.082
SMILESCCOC[C@@H](CC(C)C)NC(=O)[C@@H]1CNC[C@@H](C1)N1CC(=O)N(CC1(C)C)c1ccccc1Cl