Reaction Details
TargetTissue-type plasminogen activator
LigandBDBM50439332
Substrate/Competitorn/a
Meas. Tech.ChEMBL_978317 (CHEMBL2424098)
Ki 113±n/a nM
Citation Park, HDLee, SHKim, THLee, SHCho, KHKim, A Antithrombotic effects of LB30870, a potent, orally active, selective and direct thrombin inhibitor, and pharmacokinetics of its prodrug. Bioorg Med Chem Lett23:4779-84 (2013) 
 
Tissue-type plasminogen activator
Name:Tissue-type plasminogen activator
Type:Enzyme
Mol. Mass.:62931.08
Organism:Homo sapiens (Human)
Description:n/a
Residue:562
BDBM50439332
NameBDBM50439332
Synonyms:CHEMBL2419745
TypeSmall organic molecule
Emp. Form.C28H31N5O4S
Mol. Mass.533.642
SMILESNC(=N)c1ccc(CNC(=O)[C@@H]2CCCN2C(=O)[C@@H](NCC(O)=O)C(c2ccccc2)c2ccccc2)s1