Reaction Details
TargetG protein-activated inward rectifier potassium channel 1
LigandBDBM95731
Substrate/Competitorn/a
Meas. Tech.ChEMBL_980168 (CHEMBL2424002)
EC50 2300±n/a nM
Citation Ramos-Hunter, SJEngers, DWKaufmann, KDu, YLindsley, CWWeaver, CDSulikowski, GA Discovery and SAR of a novel series of GIRK1/2 and GIRK1/4 activators. Bioorg Med Chem Lett23:5195-8 (2013) 
 
G protein-activated inward rectifier potassium channel 1
Name:G protein-activated inward rectifier potassium channel 1
Type:PROTEIN
Mol. Mass.:56610.74
Organism:Homo sapiens (Human)
Description:ChEMBL_107915
Residue:501
BDBM95731
NameBDBM95731
Synonyms:2-(4-chlorophenyl)-N-[3-(dimethylsulfamoyl)phenyl]acetamide MLS000374626 cid_4101833
TypeSmall organic molecule
Emp. Form.C16H17ClN2O3S
Mol. Mass.352.836
SMILESCN(C)S(=O)(=O)c1cccc(NC(=O)Cc2ccc(Cl)cc2)c1