Reaction Details
TargetG protein-activated inward rectifier potassium channel 4
LigandBDBM50439421
Substrate/Competitorn/a
Meas. Tech.ChEMBL_980171 (CHEMBL2424209)
EC50 5600±n/a nM
Citation Ramos-Hunter, SJEngers, DWKaufmann, KDu, YLindsley, CWWeaver, CDSulikowski, GA Discovery and SAR of a novel series of GIRK1/2 and GIRK1/4 activators. Bioorg Med Chem Lett23:5195-8 (2013) 
 
G protein-activated inward rectifier potassium channel 4
Name:G protein-activated inward rectifier potassium channel 4
Type:PROTEIN
Mol. Mass.:47658.06
Organism:Homo sapiens (Human)
Description:ChEMBL_107914
Residue:419
BDBM50439421
NameBDBM50439421
Synonyms:CHEMBL2420543
TypeSmall organic molecule
Emp. Form.C17H21N3O4S
Mol. Mass.363.431
SMILESCOc1ccc(NC(=O)Nc2ccc(C)c(c2)S(=O)(=O)N(C)C)cc1