Reaction Details
TargetG protein-activated inward rectifier potassium channel 4
LigandBDBM50439422
Substrate/Competitorn/a
Meas. Tech.ChEMBL_980171 (CHEMBL2424209)
EC50 6200±n/a nM
Citation Ramos-Hunter, SJEngers, DWKaufmann, KDu, YLindsley, CWWeaver, CDSulikowski, GA Discovery and SAR of a novel series of GIRK1/2 and GIRK1/4 activators. Bioorg Med Chem Lett23:5195-8 (2013) 
 
G protein-activated inward rectifier potassium channel 4
Name:G protein-activated inward rectifier potassium channel 4
Type:PROTEIN
Mol. Mass.:47658.06
Organism:Homo sapiens (Human)
Description:ChEMBL_107914
Residue:419
BDBM50439422
NameBDBM50439422
Synonyms:CHEMBL2420542
TypeSmall organic molecule
Emp. Form.C17H20ClN3O3S
Mol. Mass.381.877
SMILESCN(C)S(=O)(=O)c1cc(NC(=O)Nc2ccc(C)c(Cl)c2)ccc1C