Reaction Details
TargetG protein-activated inward rectifier potassium channel 1
LigandBDBM50439413
Substrate/Competitorn/a
Meas. Tech.ChEMBL_980173 (CHEMBL2424211)
EC50 5900±n/a nM
Citation Ramos-Hunter, SJEngers, DWKaufmann, KDu, YLindsley, CWWeaver, CDSulikowski, GA Discovery and SAR of a novel series of GIRK1/2 and GIRK1/4 activators. Bioorg Med Chem Lett23:5195-8 (2013) 
 
G protein-activated inward rectifier potassium channel 1
Name:G protein-activated inward rectifier potassium channel 1
Type:PROTEIN
Mol. Mass.:56610.74
Organism:Homo sapiens (Human)
Description:ChEMBL_107915
Residue:501
BDBM50439413
NameBDBM50439413
Synonyms:CHEMBL2420529
TypeSmall organic molecule
Emp. Form.C18H20ClNO
Mol. Mass.301.811
SMILESCC(C)(C)c1cccc(NC(=O)Cc2ccccc2Cl)c1