Reaction Details
TargetG protein-activated inward rectifier potassium channel 1
LigandBDBM50439423
Substrate/Competitorn/a
Meas. Tech.ChEMBL_980173 (CHEMBL2424211)
EC50 3300±n/a nM
Citation Ramos-Hunter, SJEngers, DWKaufmann, KDu, YLindsley, CWWeaver, CDSulikowski, GA Discovery and SAR of a novel series of GIRK1/2 and GIRK1/4 activators. Bioorg Med Chem Lett23:5195-8 (2013) 
 
G protein-activated inward rectifier potassium channel 1
Name:G protein-activated inward rectifier potassium channel 1
Type:PROTEIN
Mol. Mass.:56610.74
Organism:Homo sapiens (Human)
Description:ChEMBL_107915
Residue:501
BDBM50439423
NameBDBM50439423
Synonyms:CHEMBL2420541
TypeSmall organic molecule
Emp. Form.C16H18ClN3O3S
Mol. Mass.367.85
SMILESCN(C)S(=O)(=O)c1cc(NC(=O)Nc2ccc(Cl)cc2)ccc1C