Reaction Details
TargetCasein kinase I isoform delta
LigandBDBM50364141
Substrate/Competitorn/a
Meas. Tech.ChEMBL_977607 (CHEMBL2423574)
IC50 7.8±n/a nM
Citation Mente, SArnold, EButler, TChakrapani, SChandrasekaran, RCherry, KDiRico, KDoran, AFisher, KGalatsis, PGreen, MHayward, MHumphrey, JKnafels, JLi, JLiu, SMarconi, MMcDonald, SOhren, JParadis, VSneed, BWalton, KWager, T Ligand-protein interactions of selective casein kinase 1d inhibitors. J Med Chem56:6819-28 (2013) 
 
Casein kinase I isoform delta
Name:Casein kinase I isoform delta
Type:Enzyme
Mol. Mass.:47356.76
Organism:Homo sapiens (Human)
Description:P48730
Residue:415
BDBM50364141
NameBDBM50364141
Synonyms:CHEMBL1951415
TypeSmall organic molecule
Emp. Form.C19H20FN5
Mol. Mass.337.394
SMILESNc1nccc(n1)-c1c(ncn1C1CCCCC1)-c1ccc(F)cc1