Reaction Details
TargetTyrosine-protein kinase ABL1
LigandBDBM50439464
Substrate/Competitorn/a
Meas. Tech.ChEMBL_978336 (CHEMBL2424117)
IC50 126000±n/a nM
Citation Allen, CEChow, CLCaldwell, JJWestwood, IMvan Montfort, RLCollins, I Synthesis and evaluation of heteroaryl substituted diazaspirocycles as scaffolds to probe the ATP-binding site of protein kinases. Bioorg Med Chem21:5707-24 (2013) 
 
Tyrosine-protein kinase ABL1
Name:Tyrosine-protein kinase ABL1
Type:Enzyme
Mol. Mass.:122897.30
Organism:Homo sapiens (Human)
Description:P00519
Residue:1130
BDBM50439464
NameBDBM50439464
Synonyms:CHEMBL2420909
TypeSmall organic molecule
Emp. Form.C14H20N6
Mol. Mass.272.3488
SMILESC1CCC2(CCN(CC2)c2ncnc3nc[nH]c23)NC1