Reaction Details
TargetRibosomal protein S6 kinase alpha-5
LigandBDBM50439463
Substrate/Competitorn/a
Meas. Tech.ChEMBL_978347 (CHEMBL2424128)
IC50 700±n/a nM
Citation Allen, CEChow, CLCaldwell, JJWestwood, IMvan Montfort, RLCollins, I Synthesis and evaluation of heteroaryl substituted diazaspirocycles as scaffolds to probe the ATP-binding site of protein kinases. Bioorg Med Chem21:5707-24 (2013) 
 
Ribosomal protein S6 kinase alpha-5
Name:Ribosomal protein S6 kinase alpha-5
Type:Serine/threonine-protein kinase
Mol. Mass.:89874.44
Organism:Homo sapiens (Human)
Description:n/a
Residue:802
BDBM50439463
NameBDBM50439463
Synonyms:CHEMBL2420911
TypeSmall organic molecule
Emp. Form.C14H20N6
Mol. Mass.272.3488
SMILESC1CNCC2(C1)CCN(CC2)c1ncnc2nc[nH]c12