Reaction Details
TargetSerine/threonine-protein kinase Chk1
LigandBDBM50439463
Substrate/Competitorn/a
Meas. Tech.ChEMBL_978350 (CHEMBL2424131)
IC50 1800±n/a nM
Citation Allen, CEChow, CLCaldwell, JJWestwood, IMvan Montfort, RLCollins, I Synthesis and evaluation of heteroaryl substituted diazaspirocycles as scaffolds to probe the ATP-binding site of protein kinases. Bioorg Med Chem21:5707-24 (2013) 
 
Serine/threonine-protein kinase Chk1
Name:Serine/threonine-protein kinase Chk1
Type:Enzyme Catalytic Domain
Mol. Mass.:54443.02
Organism:Homo sapiens (Human)
Description:gi_166295192
Residue:476
BDBM50439463
NameBDBM50439463
Synonyms:CHEMBL2420911
TypeSmall organic molecule
Emp. Form.C14H20N6
Mol. Mass.272.3488
SMILESC1CNCC2(C1)CCN(CC2)c1ncnc2nc[nH]c12