Reaction Details
TargetSerine/threonine-protein kinase Chk1
LigandBDBM50439466
Substrate/Competitorn/a
Meas. Tech.ChEMBL_978350 (CHEMBL2424131)
IC50 12800±n/a nM
Citation Allen, CEChow, CLCaldwell, JJWestwood, IMvan Montfort, RLCollins, I Synthesis and evaluation of heteroaryl substituted diazaspirocycles as scaffolds to probe the ATP-binding site of protein kinases. Bioorg Med Chem21:5707-24 (2013) 
 
Serine/threonine-protein kinase Chk1
Name:Serine/threonine-protein kinase Chk1
Type:Enzyme Catalytic Domain
Mol. Mass.:54443.02
Organism:Homo sapiens (Human)
Description:gi_166295192
Residue:476
BDBM50439466
NameBDBM50439466
Synonyms:CHEMBL2420922
TypeSmall organic molecule
Emp. Form.C18H23N3O2S
Mol. Mass.345.459
SMILESO=S(=O)(N1CCCC2(CCCNC2)C1)c1cccc2cnccc12