Reaction Details
TargetMitogen-activated protein kinase 1
LigandBDBM50439464
Substrate/Competitorn/a
Meas. Tech.ChEMBL_978338 (CHEMBL2424119)
IC50 47000±n/a nM
Citation Allen, CEChow, CLCaldwell, JJWestwood, IMvan Montfort, RLCollins, I Synthesis and evaluation of heteroaryl substituted diazaspirocycles as scaffolds to probe the ATP-binding site of protein kinases. Bioorg Med Chem21:5707-24 (2013) 
 
Mitogen-activated protein kinase 1
Name:Mitogen-activated protein kinase 1
Type:Ser/Thr Protein Kinase
Mol. Mass.:41392.76
Organism:Homo sapiens (Human)
Description:P28482
Residue:360
BDBM50439464
NameBDBM50439464
Synonyms:CHEMBL2420909
TypeSmall organic molecule
Emp. Form.C14H20N6
Mol. Mass.272.3488
SMILESC1CCC2(CCN(CC2)c2ncnc3nc[nH]c23)NC1