Reaction Details
TargetMAP kinase-activated protein kinase 5
LigandBDBM50439464
Substrate/Competitorn/a
Meas. Tech.ChEMBL_978341 (CHEMBL2424122)
IC50 226000±n/a nM
Citation Allen, CEChow, CLCaldwell, JJWestwood, IMvan Montfort, RLCollins, I Synthesis and evaluation of heteroaryl substituted diazaspirocycles as scaffolds to probe the ATP-binding site of protein kinases. Bioorg Med Chem21:5707-24 (2013) 
 
MAP kinase-activated protein kinase 5
Name:MAP kinase-activated protein kinase 5
Type:Serine/threonine-protein kinase
Mol. Mass.:54229.92
Organism:Homo sapiens (Human)
Description:Recombinant MAPKAPK5 was phosphorylated by incubation with active p38alpha before assays.
Residue:473
BDBM50439464
NameBDBM50439464
Synonyms:CHEMBL2420909
TypeSmall organic molecule
Emp. Form.C14H20N6
Mol. Mass.272.3488
SMILESC1CCC2(CCN(CC2)c2ncnc3nc[nH]c23)NC1