Reaction Details
TargetAurora kinase A
LigandBDBM50439463
Substrate/Competitorn/a
Meas. Tech.ChEMBL_978344 (CHEMBL2424125)
IC50 9800±n/a nM
Citation Allen, CEChow, CLCaldwell, JJWestwood, IMvan Montfort, RLCollins, I Synthesis and evaluation of heteroaryl substituted diazaspirocycles as scaffolds to probe the ATP-binding site of protein kinases. Bioorg Med Chem21:5707-24 (2013) 
 
Aurora kinase A
Name:Aurora kinase A
Type:Serine/threonine-protein kinase
Mol. Mass.:45830.98
Organism:Homo sapiens (Human)
Description:O14965
Residue:403
BDBM50439463
NameBDBM50439463
Synonyms:CHEMBL2420911
TypeSmall organic molecule
Emp. Form.C14H20N6
Mol. Mass.272.3488
SMILESC1CNCC2(C1)CCN(CC2)c1ncnc2nc[nH]c12