Reaction Details
TargetAurora kinase A
LigandBDBM50439464
Substrate/Competitorn/a
Meas. Tech.ChEMBL_978344 (CHEMBL2424125)
IC50 7800±n/a nM
Citation Allen, CEChow, CLCaldwell, JJWestwood, IMvan Montfort, RLCollins, I Synthesis and evaluation of heteroaryl substituted diazaspirocycles as scaffolds to probe the ATP-binding site of protein kinases. Bioorg Med Chem21:5707-24 (2013) 
 
Aurora kinase A
Name:Aurora kinase A
Type:Serine/threonine-protein kinase
Mol. Mass.:45830.98
Organism:Homo sapiens (Human)
Description:O14965
Residue:403
BDBM50439464
NameBDBM50439464
Synonyms:CHEMBL2420909
TypeSmall organic molecule
Emp. Form.C14H20N6
Mol. Mass.272.3488
SMILESC1CCC2(CCN(CC2)c2ncnc3nc[nH]c23)NC1