Reaction Details
TargetCell division protein FtsZ
LigandBDBM50439495
Substrate/Competitorn/a
Meas. Tech.ChEMBL_979349 (CHEMBL2423040)
IC50 67000±n/a nM
Citation Keffer, JLHuecas, SHammill, JTWipf, PAndreu, JMBewley, CA Chrysophaentins are competitive inhibitors of FtsZ and inhibit Z-ring formation in live bacteria. Bioorg Med Chem21:5673-8 (2013) 
 
Cell division protein FtsZ
Name:Cell division protein FtsZ
Type:Protein
Mol. Mass.:41023.36
Organism:Staphylococcus aureus
Description:P0A031
Residue:390
BDBM50439495
NameBDBM50439495
Synonyms:CHEMBL2418095
TypeSmall organic molecule
Emp. Form.C32H24Cl4O8
Mol. Mass.678.34
SMILESOc1cc(O)c2Oc3cc(C\C=C(Cl)/Cc4cc(O)c(Oc5cc(C\C=C(Cl)/Cc2c1)c(O)cc5Cl)c(O)c4)c(O)cc3Cl