Reaction Details
TargetSerine/threonine-protein kinase mTOR
LigandBDBM50439527
Substrate/Competitorn/a
Meas. Tech.ChEMBL_979638 (CHEMBL2421130)
Ki 30±n/a nM
Citation Lee, WOrtwine, DFBergeron, PLau, KLin, LMalek, SNonomiya, JPei, ZRobarge, KDSchmidt, SSideris, SLyssikatos, JP A hit to lead discovery of novel N-methylated imidazolo-, pyrrolo-, and pyrazolo-pyrimidines as potent and selective mTOR inhibitors. Bioorg Med Chem Lett23:5097-104 (2013) 
 
Serine/threonine-protein kinase mTOR
Name:Serine/threonine-protein kinase mTOR
Type:Rapamycin target protein
Mol. Mass.:288917.12
Organism:Homo sapiens (Human)
Description:P42345
Residue:2549
BDBM50439527
NameBDBM50439527
Synonyms:CHEMBL2418339
TypeSmall organic molecule
Emp. Form.C20H25N7O2
Mol. Mass.395.4582
SMILESCCNC(=O)Nc1ccc(cc1)-c1nc(N2CCOC[C@@H]2C)c2n(C)cnc2n1