Reaction Details
TargetMetabotropic glutamate receptor 1
LigandBDBM50439544
Substrate/Competitorn/a
Meas. Tech.ChEMBL_979659 (CHEMBL2421151)
IC50 93±n/a nM
Citation Manka, JTRodriguez, ALMorrison, RDVenable, DFCho, HPBlobaum, ALDaniels, JSNiswender, CMConn, PJLindsley, CWEmmitte, KA Octahydropyrrolo[3,4-c]pyrrole negative allosteric modulators of mGlu1. Bioorg Med Chem Lett23:5091-6 (2013) 
 
Metabotropic glutamate receptor 1
Name:Metabotropic glutamate receptor 1
Type:Enzyme
Mol. Mass.:132358.19
Organism:Homo sapiens (Human)
Description:Q13255
Residue:1194
BDBM50439544
NameBDBM50439544
Synonyms:CHEMBL2418380
TypeSmall organic molecule
Emp. Form.C22H28FN3O
Mol. Mass.369.4756
SMILESFc1cccc(n1)N1C[C@@H]2CN(C[C@@H]2C1)C(=O)C12CC3CC(CC(C3)C1)C2