Reaction Details
TargetTyrosine-protein kinase JAK3
LigandBDBM30192
Substrate/Competitorn/a
Meas. Tech.ChEMBL_979937 (CHEMBL2422670)
IC50 501±n/a nM
Citation Gao, CCahya, SNicolaou, CAWang, JWatson, IACummins, DJIversen, PWVieth, M Selectivity data: assessment, predictions, concordance, and implications. J Med Chem56:6991-7002 (2013) 
 
Tyrosine-protein kinase JAK3
Name:Tyrosine-protein kinase JAK3
Type:Protein
Mol. Mass.:125111.08
Organism:Homo sapiens (Human)
Description:P52333
Residue:1124
BDBM30192
NameBDBM30192
Synonyms:Pyrrolopyridine, 23
TypeSmall organic molecule
Emp. Form.C18H14FN3O
Mol. Mass.307.3217
SMILESFc1ccccc1-c1cc(ccn1)-c1cc2c(CCNC2=O)[nH]1