Reaction Details
TargetGlycogen phosphorylase, muscle form
LigandBDBM50263773
Substrate/Competitorn/a
Meas. Tech.ChEMBL_979985 (CHEMBL2423068)
Ki 350±n/a nM
Citation Polyák, MVarga, GSzilágyi, BJuhász, LDocsa, TGergely, PBegum, JHayes, JMSomsák, L Synthesis, enzyme kinetics and computational evaluation of N-(ß-D-glucopyranosyl) oxadiazolecarboxamides as glycogen phosphorylase inhibitors. Bioorg Med Chem21:5738-47 (2013) 
 
Glycogen phosphorylase, muscle form
Name:Glycogen phosphorylase, muscle form
Type:Enzyme
Mol. Mass.:97296.32
Organism:Oryctolagus cuniculus (rabbit)
Description:Phosphorylation of Ser-15 converts phosphorylase B (unphosphorylated) to phosphorylase A.
Residue:843
BDBM50263773
NameBDBM50263773
Synonyms:1-(2-naphthoyl)-3-((2R,3R,4S,5S,6R)-3,4,5-trihydroxy-6-(hydroxymethyl)-tetrahydro-2H-pyran-2-yl)urea N-((2R,3R,4S,5S,6R)-3,4,5-trihydroxy-6-(hydroxymethyl)tetrahydro-2H-pyran-2-ylcarbamoyl)-2-naphthamide
TypeSmall organic molecule
Emp. Form.C18H20N2O7
Mol. Mass.376.3606
SMILESOC[C@H]1O[C@@H](NC(=O)NC(=O)c2ccc3ccccc3c2)[C@H](O)[C@@H](O)[C@@H]1O