Reaction Details
TargetOrexin/Hypocretin receptor type 1
LigandBDBM50292929
Substrate/Competitorn/a
Meas. Tech.ChEMBL_980238 (CHEMBL2421153)
IC50 119±n/a nM
Citation Perrey, DAGerman, NAGilmour, BPLi, JXHarris, DLThomas, BFZhang, Y Substituted tetrahydroisoquinolines as selective antagonists for the orexin 1 receptor. J Med Chem56:6901-16 (2013) 
 
Orexin/Hypocretin receptor type 1
Name:Orexin/Hypocretin receptor type 1
Type:Protein
Mol. Mass.:47554.50
Organism:Homo sapiens (Human)
Description:O43613
Residue:425
BDBM50292929
NameBDBM50292929
Synonyms:CHEMBL455136 | almorexant
TypeSmall organic molecule
Emp. Form.C29H31F3N2O3
Mol. Mass.512.5632
SMILESCNC(=O)[C@H](N1CCc2cc(OC)c(OC)cc2[C@@H]1CCc1ccc(cc1)C(F)(F)F)c1ccccc1