Reaction Details
TargetMineralocorticoid receptor
LigandBDBM50439607
Substrate/Competitorn/a
Meas. Tech.ChEMBL_977680 (CHEMBL2423838)
IC50 43±n/a nM
Citation Hasui, TOhra, TOhyabu, NAsano, KMatsui, HMizukami, AHabuka, NSogabe, SEndo, SSiedem, CSTang, TPGauthier, CDe Meese, LABoyd, SAFukumoto, S Design, synthesis, and structure-activity relationships of dihydrofuran-2-one and dihydropyrrol-2-one derivatives as novel benzoxazin-3-one-based mineralocorticoid receptor antagonists. Bioorg Med Chem21:5983-94 (2013) 
 
Mineralocorticoid receptor
Name:Mineralocorticoid receptor
Type:Enzyme
Mol. Mass.:107076.42
Organism:Homo sapiens (Human)
Description:P08235
Residue:984
BDBM50439607
NameBDBM50439607
Synonyms:CHEMBL2419301
TypeSmall organic molecule
Emp. Form.C20H17FN2O3
Mol. Mass.352.359
SMILESCC1NC(=O)C(=C1c1cc(C)c2OCC(=O)Nc2c1)c1ccc(F)cc1