Reaction Details
TargetEndoplasmin
LigandBDBM50439624
Substrate/Competitorn/a
Meas. Tech.ChEMBL_977713 (CHEMBL2424070)
Kd 31±n/a nM
Citation Taldone, TPatel, PDPatel, MPatel, HJEvans, CERodina, AOchiana, SShah, SKUddin, MGewirth, DChiosis, G Experimental and structural testing module to analyze paralogue-specificity and affinity in the Hsp90 inhibitors series. J Med Chem56:6803-18 (2013) 
 
Endoplasmin
Name:Endoplasmin
Type:PROTEIN
Mol. Mass.:92464.42
Organism:Canis familiaris
Description:ChEMBL_1478277
Residue:804
BDBM50439624
NameBDBM50439624
Synonyms:CHEMBL1910764
TypeSmall organic molecule
Emp. Form.C39H32IN7O7S2
Mol. Mass.901.749
SMILESCC(C)N(CCCn1c(Sc2cc3OCOc3cc2I)nc2c(N)ncnc12)C(=S)Nc1ccc(c(c1)C(O)=O)-c1c2ccc(O)cc2oc2cc(=O)ccc12