Reaction Details
TargetAcetyl-CoA carboxylase 1
LigandBDBM50439629
Substrate/Competitorn/a
Meas. Tech.ChEMBL_978106 (CHEMBL2422748)
IC50 74±n/a nM
Citation Griffith, DADow, RLHuard, KEdmonds, DJBagley, SWPolivkova, JZeng, DGarcia-Irizarry, CNSouthers, JAEsler, WAmor, PLoomis, KMcPherson, KBahnck, KBPréville, CBanks, TMoore, DEMathiowetz, AMMenhaji-Klotz, ESmith, ACDoran, SDBeebe, DADunn, MF Spirolactam-based acetyl-CoA carboxylase inhibitors: toward improved metabolic stability of a chromanone lead structure. J Med Chem56:7110-9 (2013) 
 
Acetyl-CoA carboxylase 1
Name:Acetyl-CoA carboxylase 1
Type:Protein
Mol. Mass.:265543.22
Organism:Homo sapiens (Human)
Description:Q13085
Residue:2346
BDBM50439629
NameBDBM50439629
Synonyms:CHEMBL2419595 | US8993586, 102
TypeSmall organic molecule
Emp. Form.C25H29N5O3
Mol. Mass.447.5295
SMILESCOc1cc2cc(ccc2cn1)C(=O)N1CCC2(CC1)Cc1cn(nc1C(=O)N2)C(C)(C)C