Reaction Details
TargetAcetyl-CoA carboxylase 2
LigandBDBM50439631
Substrate/Competitorn/a
Meas. Tech.ChEMBL_978105 (CHEMBL2422747)
IC50 68±n/a nM
Citation Griffith, DADow, RLHuard, KEdmonds, DJBagley, SWPolivkova, JZeng, DGarcia-Irizarry, CNSouthers, JAEsler, WAmor, PLoomis, KMcPherson, KBahnck, KBPréville, CBanks, TMoore, DEMathiowetz, AMMenhaji-Klotz, ESmith, ACDoran, SDBeebe, DADunn, MF Spirolactam-based acetyl-CoA carboxylase inhibitors: toward improved metabolic stability of a chromanone lead structure. J Med Chem56:7110-9 (2013) 
 
Acetyl-CoA carboxylase 2
Name:Acetyl-CoA carboxylase 2
Type:Protein
Mol. Mass.:276535.21
Organism:Homo sapiens (Human)
Description:O00763
Residue:2458
BDBM50439631
NameBDBM50439631
Synonyms:CHEMBL2419608
TypeSmall organic molecule
Emp. Form.C24H30N6O2
Mol. Mass.434.534
SMILESCc1n[nH]c2c(C)cc(cc12)C(=O)N1CCC2(CC1)Cc1cnn(c1C(=O)N2)C(C)(C)C