Reaction Details
TargetAcetyl-CoA carboxylase 2
LigandBDBM50439645
Substrate/Competitorn/a
Meas. Tech.ChEMBL_978105 (CHEMBL2422747)
IC50 4.5±n/a nM
Citation Griffith, DADow, RLHuard, KEdmonds, DJBagley, SWPolivkova, JZeng, DGarcia-Irizarry, CNSouthers, JAEsler, WAmor, PLoomis, KMcPherson, KBahnck, KBPréville, CBanks, TMoore, DEMathiowetz, AMMenhaji-Klotz, ESmith, ACDoran, SDBeebe, DADunn, MF Spirolactam-based acetyl-CoA carboxylase inhibitors: toward improved metabolic stability of a chromanone lead structure. J Med Chem56:7110-9 (2013) 
 
Acetyl-CoA carboxylase 2
Name:Acetyl-CoA carboxylase 2
Type:Protein
Mol. Mass.:276535.21
Organism:Homo sapiens (Human)
Description:O00763
Residue:2458
BDBM50439645
NameBDBM50439645
Synonyms:CHEMBL2419607
TypeSmall organic molecule
Emp. Form.C25H32N6O2
Mol. Mass.448.5606
SMILESCCC(C)(C)n1cc2CC3(CCN(CC3)C(=O)c3cc(C)c4[nH]nc(C)c4c3)NC(=O)c2n1