Reaction Details
TargetHistone deacetylase 3
LigandBDBM50439674
Substrate/Competitorn/a
Meas. Tech.ChEMBL_977759 (CHEMBL2424306)
IC50 51±n/a nM
Citation Kalin, JHBergman, JA Development and therapeutic implications of selective histone deacetylase 6 inhibitors. J Med Chem56:6297-313 (2013) 
 
Histone deacetylase 3
Name:Histone deacetylase 3
Type:Enzyme
Mol. Mass.:48829.55
Organism:Homo sapiens (Human)
Description:O15379
Residue:428
BDBM50439674
NameBDBM50439674
Synonyms:RICOLINOSTAT US11207431, Example E US8609678, 2-(diphenylamino)-N-(7-(hydroxyamino)-7-oxoheptyl)pyrimidine-5-carboxamide [26]
TypeSmall organic molecule
Emp. Form.C24H27N5O3
Mol. Mass.433.5029
SMILESONC(=O)CCCCCCNC(=O)c1cnc(nc1)N(c1ccccc1)c1ccccc1