Reaction Details
TargetEctonucleotide pyrophosphatase/phosphodiesterase family member 2
LigandBDBM50439705
Substrate/Competitorn/a
Meas. Tech.ChEMBL_979385 (CHEMBL2423244)
Ki 500±n/a nM
Citation Norman, DDIbezim, AScott, WEWhite, SParrill, ALBaker, DL Autotaxin inhibition: development and application of computational tools to identify site-selective lead compounds. Bioorg Med Chem21:5548-60 (2013) 
 
Ectonucleotide pyrophosphatase/phosphodiesterase family member 2
Name:Ectonucleotide pyrophosphatase/phosphodiesterase family member 2
Type:Enzyme
Mol. Mass.:99007.13
Organism:Homo sapiens (Human)
Description:Q13822
Residue:863
BDBM50439705
NameBDBM50439705
Synonyms:CHEMBL2418932
TypeSmall organic molecule
Emp. Form.C33H45N5O5
Mol. Mass.591.7409
SMILESCC(O)C(NC(=O)c1ccc(nc1)N1CCC(CCCC2CCN(CC2)C(=O)CCC(=O)c2ccccc2)CC1)C(N)=O