Reaction Details
TargetDNA-dependent protein kinase catalytic subunit
LigandBDBM50439935
Substrate/Competitorn/a
Meas. Tech.ChEMBL_978844 (CHEMBL2423446)
IC50 6±n/a nM
Citation Cano, CSaravanan, KBailey, CBardos, JCurtin, NJFrigerio, MGolding, BTHardcastle, IRHummersone, MGMenear, KANewell, DRRichardson, CJShea, KSmith, GCThommes, PTing, AGriffin, RJ 1-substituted (Dibenzo[b,d]thiophen-4-yl)-2-morpholino-4H-chromen-4-ones endowed with dual DNA-PK/PI3-K inhibitory activity. J Med Chem56:6386-401 (2013) 
 
DNA-dependent protein kinase catalytic subunit
Name:DNA-dependent protein kinase catalytic subunit
Type:Protein
Mol. Mass.:469114.78
Organism:Homo sapiens (Human)
Description:P78527
Residue:4128
BDBM50439935
NameBDBM50439935
Synonyms:CHEMBL2420264
TypeSmall organic molecule
Emp. Form.C31H28N2O8S
Mol. Mass.588.628
SMILESCOC(=O)[C@H](CO)NC(=O)COc1ccc(-c2cccc3c2oc(cc3=O)N2CCOCC2)c2sc3ccccc3c12