Reaction Details
TargetDNA-dependent protein kinase catalytic subunit
LigandBDBM50156495
Substrate/Competitorn/a
Meas. Tech.ChEMBL_978845 (CHEMBL2423447)
IC50 40±n/a nM
Citation Cano, CSaravanan, KBailey, CBardos, JCurtin, NJFrigerio, MGolding, BTHardcastle, IRHummersone, MGMenear, KANewell, DRRichardson, CJShea, KSmith, GCThommes, PTing, AGriffin, RJ 1-substituted (Dibenzo[b,d]thiophen-4-yl)-2-morpholino-4H-chromen-4-ones endowed with dual DNA-PK/PI3-K inhibitory activity. J Med Chem56:6386-401 (2013) 
 
DNA-dependent protein kinase catalytic subunit
Name:DNA-dependent protein kinase catalytic subunit
Type:Protein
Mol. Mass.:469114.78
Organism:Homo sapiens (Human)
Description:P78527
Residue:4128
BDBM50156495
NameBDBM50156495
Synonyms:8-(dibenzo[b,d]thiophen-4-yl)-2-morpholino-4H-chromen-4-one 8-dibenzothiophen-1-yl-2-morpholin-4-yl-chromen-4-one NU-7432 | NU-7441
TypeSmall organic molecule
Emp. Form.C25H19NO3S
Mol. Mass.413.488
SMILESO=c1cc(oc2c(cccc12)-c1cccc2c3ccccc3sc12)N1CCOCC1