Reaction Details
TargetOrexin/Hypocretin receptor type 1
LigandBDBM50440025
Substrate/Competitorn/a
Meas. Tech.ChEMBL_982718 (CHEMBL2428738)
Ki 3.0±n/a nM
Citation Oi, NSuzuki, MTerauchi, TTokunaga, MNakatani, YYamamoto, NFukumura, TZhang, MRSuhara, THiguchi, M Synthesis and evaluation of novel radioligands for positron emission tomography imaging of the orexin-2 receptor. J Med Chem56:6371-85 (2013) 
 
Orexin/Hypocretin receptor type 1
Name:Orexin/Hypocretin receptor type 1
Type:Protein
Mol. Mass.:47554.50
Organism:Homo sapiens (Human)
Description:O43613
Residue:425
BDBM50440025
NameBDBM50440025
Synonyms:CHEMBL2425784
TypeSmall organic molecule
Emp. Form.C23H22F2N4O3
Mol. Mass.440.4426
SMILESCOc1cc(NC(=O)[C@@H]2C[C@@]2(COc2cnc(C)nc2C)c2cccc(F)c2)ncc1F